Publish Nebula Storage alpha.7: craft output grid and compatible dependencies
All checks were successful
Build Nebula Storage / Build and packaged GameTests (push) Successful in 14m55s
CI detail / build Passed
CI detail / vanilla Passed
CI detail / mekanism Passed
CI detail / industrial Passed
CI detail / older-kotlin Passed
CI detail / newer-kotlin Passed
CI detail / package Passed
Build Nebula Storage / Build and packaged GameTests (pull_request) Successful in 15m19s
Isolate concurrent craftability GameTests before the alpha.7 release
All checks were successful
CI detail / build Passed
CI detail / vanilla Passed
CI detail / mekanism Passed
CI detail / industrial Passed
CI detail / older-kotlin Passed
CI detail / newer-kotlin Passed
CI detail / package Passed
Build Nebula Storage / Build and packaged GameTests (pull_request) Successful in 15m11s
Preserve the exact failing GameTest assertion in CI diagnostics
All checks were successful
CI detail / build Passed
CI detail / vanilla Passed
CI detail / mekanism Passed
CI detail / industrial Passed
CI detail / older-kotlin Passed
CI detail / newer-kotlin Passed
CI detail / package Passed
Build Nebula Storage / Build and packaged GameTests (pull_request) Successful in 14m40s
Adopt Nebula Storage identity and prepare public alpha
Some checks failed
CI detail / newer-kotlin Passed
CI detail / package Passed
CI detail / build Passed
CI detail / vanilla Passed
CI detail / mekanism Passed
CI detail / industrial Passed
CI detail / older-kotlin Exit 1: BUILD FAILED in 2m 25s
CI detail / older-kotlin / 1 [20:33:45] [Server thread/ERROR] [de.ne.in.pe.CoreStorageData$Companion/]: Nebula production data quarantined: Failed requirement.
CI detail / older-kotlin / 2 [20:33:45] [Server thread/ERROR] [de.ne.in.pe.CoreStorageData$Companion/]: Nebula production data quarantined: Failed requirement.
CI detail / older-kotlin / 3 [20:33:45] [Server thread/ERROR] [de.ne.in.pe.CoreStorageData$Companion/]: Nebula production data quarantined: Failed requirement.
CI detail / older-kotlin / 4 [20:33:45] [Server thread/ERROR] [de.ne.in.pe.CoreStorageData$Companion/]: Nebula production data quarantined: Failed requirement.
CI detail / older-kotlin / 5 [20:33:48] [Server thread/ERROR] [de.ne.in.pe.CoreStorageData$Companion/]: Nebula production data quarantined: Failed requirement.
CI detail / older-kotlin / 6 [20:33:48] [Server thread/ERROR] [de.ne.in.pe.CoreStorageData$Companion/]: Nebula production data quarantined: Failed requirement.
CI detail / older-kotlin / 7 [20:34:20] [Server thread/WARN] [de.ne.in.ex.WorldExternalNetworks/]: Nebula external network c91f4c1b-26ae-4764-8cad-9edf6113f261 has 1 compatibility problems: [ExternalIssue(address=minecraft:overworld|-1284088828247466043, reason=invento
CI detail / older-kotlin / 8 [20:34:20] [Server thread/WARN] [de.ne.in.ex.WorldExternalNetworks/]: Nebula external network c91f4c1b-26ae-4764-8cad-9edf6113f261 has 1 compatibility problems: [ExternalIssue(address=minecraft:overworld|-1284088828247466043, reason=invento
CI detail / older-kotlin / 9 [20:34:22] [Server thread/ERROR] [de.ne.in.pe.CoreStorageData$Companion/]: Nebula production data quarantined: Failed requirement.
CI detail / older-kotlin / 10 > Task :runPackagedTestServer FAILED
CI detail / older-kotlin / 11 > Process 'command '/home/ubuntu/.cache/act/tool_cache/Java_Temurin-Hotspot_jdk/21.0.12-101.0.LTS/x64/bin/java'' finished with non-zero exit value 1
CI detail / older-kotlin / 12 > Run with --stacktrace option to get the stack trace.
CI detail / older-kotlin / 13 > Run with --info or --debug option to get more log output.
CI detail / older-kotlin / 14 > Run with --scan to get full insights.
CI detail / older-kotlin / 15 > Get more help at https://help.gradle.org.
CI detail / older-kotlin / 16 BUILD FAILED in 2m 25s
Build Nebula Storage / Build and packaged GameTests (pull_request) Failing after 12m36s
Fix beta setup, rendering and interface sizing
All checks were successful
Build Nexus Storage / Build and packaged GameTests (pull_request) Successful in 12m13s
fix: clarify the NS logo
All checks were successful
Build Nexus Storage / Build and packaged GameTests (pull_request) Successful in 11m59s
Share the new pixel-grid Nexus logo with the website
All checks were successful
Build Nexus Storage / Build and packaged GameTests (pull_request) Successful in 11m57s
Corriger l’éditeur de panneaux et les contours solaires
All checks were successful
Build Nexus Storage / Build and packaged GameTests (pull_request) Successful in 12m17s
feat: edit rich documents on joined information panels
All checks were successful
Build Nexus Storage / Build and packaged GameTests (pull_request) Successful in 12m26s